icecast error

Mike Burney mburney8 at
Wed Oct 22 23:03:18 GMT 2003

I turned off all options and still can't get this to work.  Any ideas?

t.o static.o http.o ice_string.o dir.o vars.o memory.o ice_resolv.o 
item.o pool.o interpreter.o vsnprintf.o authenticate/libauthenticate.a   
-lm  -lpthread
commands.o(.text+0x5338): In function `com_dump':
: undefined reference to `errno'
collect2: ld returned 1 exit status
make[3]: *** [icecast] Error 1
make[3]: Leaving directory `/usr/src/icecast-1.3.12/src'
make[2]: *** [all-recursive] Error 1
make[2]: Leaving directory `/usr/src/icecast-1.3.12/src'
make[1]: *** [all-recursive] Error 1
make[1]: Leaving directory `/usr/src/icecast-1.3.12'
Creating /var/log/lunar/compile/icecast-1.3.12.bz2
! Problem detected during BUILD


More information about the lunar mailing list